CRAN Package Check Results for Package bayesplot

Last updated on 2020-01-21 23:50:46 CET.

Flavor Version Tinstall Tcheck Ttotal Status Flags
r-devel-linux-x86_64-debian-clang 1.7.1 13.33 303.33 316.66 OK
r-devel-linux-x86_64-debian-gcc 1.7.1 10.80 181.78 192.58 ERROR
r-devel-linux-x86_64-fedora-clang 1.7.1 296.03 ERROR
r-devel-linux-x86_64-fedora-gcc 1.7.1 313.42 ERROR
r-devel-windows-ix86+x86_64 1.7.1 31.00 395.00 426.00 NOTE
r-devel-windows-ix86+x86_64-gcc8 1.7.1 38.00 384.00 422.00 NOTE
r-patched-linux-x86_64 1.7.1 12.40 217.53 229.93 ERROR
r-patched-solaris-x86 1.7.1 296.70 ERROR
r-release-linux-x86_64 1.7.1 10.56 219.73 230.29 ERROR
r-release-windows-ix86+x86_64 1.7.1 20.00 245.00 265.00 NOTE
r-release-osx-x86_64 1.7.1 NOTE
r-oldrel-windows-ix86+x86_64 1.7.1 16.00 247.00 263.00 NOTE
r-oldrel-osx-x86_64 1.7.1 NOTE

Check Details

Version: 1.7.1
Check: package dependencies
Result: NOTE
    Package suggested but not available for checking: ‘rstanarm’
Flavors: r-devel-linux-x86_64-debian-gcc, r-devel-linux-x86_64-fedora-clang, r-devel-linux-x86_64-fedora-gcc, r-patched-linux-x86_64, r-patched-solaris-x86, r-release-linux-x86_64

Version: 1.7.1
Check: tests
Result: ERROR
     Running ‘testthat.R’ [59s/88s]
    Running the tests in ‘tests/testthat.R’ failed.
    Complete output:
     > library(testthat)
     > library(bayesplot)
     This is bayesplot version 1.7.1
     - Online documentation and vignettes at mc-stan.org/bayesplot
     - bayesplot theme set to bayesplot::theme_default()
     * Does _not_ affect other ggplot2 plots
     * See ?bayesplot_theme_set for details on theme setting
     >
     > Sys.unsetenv("R_TESTS")
     > test_check("bayesplot")
     ── 1. Error: (unknown) (@test-extractors.R#2) ─────────────────────────────────
     there is no package called 'rstanarm'
     Backtrace:
     1. base::suppressPackageStartupMessages(library(rstanarm))
     3. base::library(rstanarm)
    
     ── 2. Error: prepare_mcmc_array processes non-array input types correctly (@test
     there is no package called 'rstanarm'
     Backtrace:
     1. base::suppressPackageStartupMessages(library(rstanarm))
     3. base::library(rstanarm)
    
     ── 3. Error: (unknown) (@test-mcmc-nuts.R#2) ──────────────────────────────────
     there is no package called 'rstanarm'
     Backtrace:
     1. base::suppressPackageStartupMessages(library(rstanarm))
     3. base::library(rstanarm)
    
     ── 4. Error: (unknown) (@test-mcmc-recover.R#2) ───────────────────────────────
     there is no package called 'rstanarm'
     Backtrace:
     1. base::suppressPackageStartupMessages(library(rstanarm))
     3. base::library(rstanarm)
    
     ── 5. Error: (unknown) (@test-mcmc-scatter-and-parcoord.R#2) ──────────────────
     there is no package called 'rstanarm'
     Backtrace:
     1. base::suppressPackageStartupMessages(library(rstanarm))
     3. base::library(rstanarm)
    
     ── 6. Error: (unknown) (@test-ppc-discrete.R#2) ───────────────────────────────
     there is no package called 'rstanarm'
     Backtrace:
     1. base::suppressPackageStartupMessages(library(rstanarm))
     3. base::library(rstanarm)
    
     ── 7. Error: (unknown) (@test-ppc-loo.R#2) ────────────────────────────────────
     there is no package called 'rstanarm'
     Backtrace:
     1. base::suppressPackageStartupMessages(library(rstanarm))
     3. base::library(rstanarm)
    
     ══ testthat results ═══════════════════════════════════════════════════════════
     [ OK: 789 | SKIPPED: 33 | WARNINGS: 0 | FAILED: 7 ]
     1. Error: (unknown) (@test-extractors.R#2)
     2. Error: prepare_mcmc_array processes non-array input types correctly (@test-helpers-mcmc.R#244)
     3. Error: (unknown) (@test-mcmc-nuts.R#2)
     4. Error: (unknown) (@test-mcmc-recover.R#2)
     5. Error: (unknown) (@test-mcmc-scatter-and-parcoord.R#2)
     6. Error: (unknown) (@test-ppc-discrete.R#2)
     7. Error: (unknown) (@test-ppc-loo.R#2)
    
     Error: testthat unit tests failed
     Execution halted
Flavor: r-devel-linux-x86_64-debian-gcc

Version: 1.7.1
Check: installed package size
Result: NOTE
     installed size is 6.6Mb
     sub-directories of 1Mb or more:
     R 1.8Mb
     doc 4.1Mb
Flavors: r-devel-linux-x86_64-fedora-clang, r-devel-windows-ix86+x86_64, r-devel-windows-ix86+x86_64-gcc8, r-patched-solaris-x86, r-release-windows-ix86+x86_64, r-release-osx-x86_64, r-oldrel-windows-ix86+x86_64, r-oldrel-osx-x86_64

Version: 1.7.1
Check: tests
Result: ERROR
     Running ‘testthat.R’ [93s/109s]
    Running the tests in ‘tests/testthat.R’ failed.
    Complete output:
     > library(testthat)
     > library(bayesplot)
     This is bayesplot version 1.7.1
     - Online documentation and vignettes at mc-stan.org/bayesplot
     - bayesplot theme set to bayesplot::theme_default()
     * Does _not_ affect other ggplot2 plots
     * See ?bayesplot_theme_set for details on theme setting
     >
     > Sys.unsetenv("R_TESTS")
     > test_check("bayesplot")
     ── 1. Error: (unknown) (@test-extractors.R#2) ─────────────────────────────────
     there is no package called 'rstanarm'
     Backtrace:
     1. base::suppressPackageStartupMessages(library(rstanarm))
     3. base::library(rstanarm)
    
     ── 2. Error: prepare_mcmc_array processes non-array input types correctly (@test
     there is no package called 'rstanarm'
     Backtrace:
     1. base::suppressPackageStartupMessages(library(rstanarm))
     3. base::library(rstanarm)
    
     ── 3. Error: (unknown) (@test-mcmc-nuts.R#2) ──────────────────────────────────
     there is no package called 'rstanarm'
     Backtrace:
     1. base::suppressPackageStartupMessages(library(rstanarm))
     3. base::library(rstanarm)
    
     ── 4. Error: (unknown) (@test-mcmc-recover.R#2) ───────────────────────────────
     there is no package called 'rstanarm'
     Backtrace:
     1. base::suppressPackageStartupMessages(library(rstanarm))
     3. base::library(rstanarm)
    
     ── 5. Error: (unknown) (@test-mcmc-scatter-and-parcoord.R#2) ──────────────────
     there is no package called 'rstanarm'
     Backtrace:
     1. base::suppressPackageStartupMessages(library(rstanarm))
     3. base::library(rstanarm)
    
     ── 6. Error: (unknown) (@test-ppc-discrete.R#2) ───────────────────────────────
     there is no package called 'rstanarm'
     Backtrace:
     1. base::suppressPackageStartupMessages(library(rstanarm))
     3. base::library(rstanarm)
    
     ── 7. Error: (unknown) (@test-ppc-loo.R#2) ────────────────────────────────────
     there is no package called 'rstanarm'
     Backtrace:
     1. base::suppressPackageStartupMessages(library(rstanarm))
     3. base::library(rstanarm)
    
     ══ testthat results ═══════════════════════════════════════════════════════════
     [ OK: 789 | SKIPPED: 33 | WARNINGS: 0 | FAILED: 7 ]
     1. Error: (unknown) (@test-extractors.R#2)
     2. Error: prepare_mcmc_array processes non-array input types correctly (@test-helpers-mcmc.R#244)
     3. Error: (unknown) (@test-mcmc-nuts.R#2)
     4. Error: (unknown) (@test-mcmc-recover.R#2)
     5. Error: (unknown) (@test-mcmc-scatter-and-parcoord.R#2)
     6. Error: (unknown) (@test-ppc-discrete.R#2)
     7. Error: (unknown) (@test-ppc-loo.R#2)
    
     Error: testthat unit tests failed
     Execution halted
Flavor: r-devel-linux-x86_64-fedora-clang

Version: 1.7.1
Check: tests
Result: ERROR
     Running ‘testthat.R’ [98s/213s]
    Running the tests in ‘tests/testthat.R’ failed.
    Complete output:
     > library(testthat)
     > library(bayesplot)
     This is bayesplot version 1.7.1
     - Online documentation and vignettes at mc-stan.org/bayesplot
     - bayesplot theme set to bayesplot::theme_default()
     * Does _not_ affect other ggplot2 plots
     * See ?bayesplot_theme_set for details on theme setting
     >
     > Sys.unsetenv("R_TESTS")
     > test_check("bayesplot")
     ── 1. Error: (unknown) (@test-extractors.R#2) ─────────────────────────────────
     there is no package called 'rstanarm'
     Backtrace:
     1. base::suppressPackageStartupMessages(library(rstanarm))
     3. base::library(rstanarm)
    
     ── 2. Error: prepare_mcmc_array processes non-array input types correctly (@test
     there is no package called 'rstanarm'
     Backtrace:
     1. base::suppressPackageStartupMessages(library(rstanarm))
     3. base::library(rstanarm)
    
     ── 3. Error: (unknown) (@test-mcmc-nuts.R#2) ──────────────────────────────────
     there is no package called 'rstanarm'
     Backtrace:
     1. base::suppressPackageStartupMessages(library(rstanarm))
     3. base::library(rstanarm)
    
     ── 4. Error: (unknown) (@test-mcmc-recover.R#2) ───────────────────────────────
     there is no package called 'rstanarm'
     Backtrace:
     1. base::suppressPackageStartupMessages(library(rstanarm))
     3. base::library(rstanarm)
    
     ── 5. Error: (unknown) (@test-mcmc-scatter-and-parcoord.R#2) ──────────────────
     there is no package called 'rstanarm'
     Backtrace:
     1. base::suppressPackageStartupMessages(library(rstanarm))
     3. base::library(rstanarm)
    
     ── 6. Error: (unknown) (@test-ppc-discrete.R#2) ───────────────────────────────
     there is no package called 'rstanarm'
     Backtrace:
     1. base::suppressPackageStartupMessages(library(rstanarm))
     3. base::library(rstanarm)
    
     ── 7. Error: (unknown) (@test-ppc-loo.R#2) ────────────────────────────────────
     there is no package called 'rstanarm'
     Backtrace:
     1. base::suppressPackageStartupMessages(library(rstanarm))
     3. base::library(rstanarm)
    
     ══ testthat results ═══════════════════════════════════════════════════════════
     [ OK: 789 | SKIPPED: 33 | WARNINGS: 0 | FAILED: 7 ]
     1. Error: (unknown) (@test-extractors.R#2)
     2. Error: prepare_mcmc_array processes non-array input types correctly (@test-helpers-mcmc.R#244)
     3. Error: (unknown) (@test-mcmc-nuts.R#2)
     4. Error: (unknown) (@test-mcmc-recover.R#2)
     5. Error: (unknown) (@test-mcmc-scatter-and-parcoord.R#2)
     6. Error: (unknown) (@test-ppc-discrete.R#2)
     7. Error: (unknown) (@test-ppc-loo.R#2)
    
     Error: testthat unit tests failed
     Execution halted
Flavor: r-devel-linux-x86_64-fedora-gcc

Version: 1.7.1
Check: tests
Result: ERROR
     Running ‘testthat.R’ [74s/84s]
    Running the tests in ‘tests/testthat.R’ failed.
    Complete output:
     > library(testthat)
     > library(bayesplot)
     This is bayesplot version 1.7.1
     - Online documentation and vignettes at mc-stan.org/bayesplot
     - bayesplot theme set to bayesplot::theme_default()
     * Does _not_ affect other ggplot2 plots
     * See ?bayesplot_theme_set for details on theme setting
     >
     > Sys.unsetenv("R_TESTS")
     > test_check("bayesplot")
     ── 1. Error: (unknown) (@test-extractors.R#2) ─────────────────────────────────
     there is no package called 'rstanarm'
     Backtrace:
     1. base::suppressPackageStartupMessages(library(rstanarm))
     3. base::library(rstanarm)
    
     ── 2. Error: prepare_mcmc_array processes non-array input types correctly (@test
     there is no package called 'rstanarm'
     Backtrace:
     1. base::suppressPackageStartupMessages(library(rstanarm))
     3. base::library(rstanarm)
    
     ── 3. Error: (unknown) (@test-mcmc-nuts.R#2) ──────────────────────────────────
     there is no package called 'rstanarm'
     Backtrace:
     1. base::suppressPackageStartupMessages(library(rstanarm))
     3. base::library(rstanarm)
    
     ── 4. Error: (unknown) (@test-mcmc-recover.R#2) ───────────────────────────────
     there is no package called 'rstanarm'
     Backtrace:
     1. base::suppressPackageStartupMessages(library(rstanarm))
     3. base::library(rstanarm)
    
     ── 5. Error: (unknown) (@test-mcmc-scatter-and-parcoord.R#2) ──────────────────
     there is no package called 'rstanarm'
     Backtrace:
     1. base::suppressPackageStartupMessages(library(rstanarm))
     3. base::library(rstanarm)
    
     ── 6. Error: (unknown) (@test-ppc-discrete.R#2) ───────────────────────────────
     there is no package called 'rstanarm'
     Backtrace:
     1. base::suppressPackageStartupMessages(library(rstanarm))
     3. base::library(rstanarm)
    
     ── 7. Error: (unknown) (@test-ppc-loo.R#2) ────────────────────────────────────
     there is no package called 'rstanarm'
     Backtrace:
     1. base::suppressPackageStartupMessages(library(rstanarm))
     3. base::library(rstanarm)
    
     ══ testthat results ═══════════════════════════════════════════════════════════
     [ OK: 789 | SKIPPED: 33 | WARNINGS: 0 | FAILED: 7 ]
     1. Error: (unknown) (@test-extractors.R#2)
     2. Error: prepare_mcmc_array processes non-array input types correctly (@test-helpers-mcmc.R#244)
     3. Error: (unknown) (@test-mcmc-nuts.R#2)
     4. Error: (unknown) (@test-mcmc-recover.R#2)
     5. Error: (unknown) (@test-mcmc-scatter-and-parcoord.R#2)
     6. Error: (unknown) (@test-ppc-discrete.R#2)
     7. Error: (unknown) (@test-ppc-loo.R#2)
    
     Error: testthat unit tests failed
     Execution halted
Flavor: r-patched-linux-x86_64

Version: 1.7.1
Check: tests
Result: ERROR
     Running ‘testthat.R’ [82s/82s]
    Running the tests in ‘tests/testthat.R’ failed.
    Complete output:
     > library(testthat)
     > library(bayesplot)
     This is bayesplot version 1.7.1
     - Online documentation and vignettes at mc-stan.org/bayesplot
     - bayesplot theme set to bayesplot::theme_default()
     * Does _not_ affect other ggplot2 plots
     * See ?bayesplot_theme_set for details on theme setting
     >
     > Sys.unsetenv("R_TESTS")
     > test_check("bayesplot")
     ── 1. Error: (unknown) (@test-extractors.R#2) ─────────────────────────────────
     there is no package called 'rstanarm'
     Backtrace:
     1. base::suppressPackageStartupMessages(library(rstanarm))
     3. base::library(rstanarm)
    
     ── 2. Error: prepare_mcmc_array processes non-array input types correctly (@test
     there is no package called 'rstanarm'
     Backtrace:
     1. base::suppressPackageStartupMessages(library(rstanarm))
     3. base::library(rstanarm)
    
     ── 3. Error: (unknown) (@test-mcmc-nuts.R#2) ──────────────────────────────────
     there is no package called 'rstanarm'
     Backtrace:
     1. base::suppressPackageStartupMessages(library(rstanarm))
     3. base::library(rstanarm)
    
     ── 4. Error: (unknown) (@test-mcmc-recover.R#2) ───────────────────────────────
     there is no package called 'rstanarm'
     Backtrace:
     1. base::suppressPackageStartupMessages(library(rstanarm))
     3. base::library(rstanarm)
    
     ── 5. Error: (unknown) (@test-mcmc-scatter-and-parcoord.R#2) ──────────────────
     there is no package called 'rstanarm'
     Backtrace:
     1. base::suppressPackageStartupMessages(library(rstanarm))
     3. base::library(rstanarm)
    
     ── 6. Error: (unknown) (@test-ppc-discrete.R#2) ───────────────────────────────
     there is no package called 'rstanarm'
     Backtrace:
     1. base::suppressPackageStartupMessages(library(rstanarm))
     3. base::library(rstanarm)
    
     ── 7. Error: (unknown) (@test-ppc-loo.R#2) ────────────────────────────────────
     there is no package called 'rstanarm'
     Backtrace:
     1. base::suppressPackageStartupMessages(library(rstanarm))
     3. base::library(rstanarm)
    
     ══ testthat results ═══════════════════════════════════════════════════════════
     [ OK: 789 | SKIPPED: 33 | WARNINGS: 0 | FAILED: 7 ]
     1. Error: (unknown) (@test-extractors.R#2)
     2. Error: prepare_mcmc_array processes non-array input types correctly (@test-helpers-mcmc.R#244)
     3. Error: (unknown) (@test-mcmc-nuts.R#2)
     4. Error: (unknown) (@test-mcmc-recover.R#2)
     5. Error: (unknown) (@test-mcmc-scatter-and-parcoord.R#2)
     6. Error: (unknown) (@test-ppc-discrete.R#2)
     7. Error: (unknown) (@test-ppc-loo.R#2)
    
     Error: testthat unit tests failed
     Execution halted
Flavor: r-patched-solaris-x86

Version: 1.7.1
Check: tests
Result: ERROR
     Running ‘testthat.R’ [73s/80s]
    Running the tests in ‘tests/testthat.R’ failed.
    Complete output:
     > library(testthat)
     > library(bayesplot)
     This is bayesplot version 1.7.1
     - Online documentation and vignettes at mc-stan.org/bayesplot
     - bayesplot theme set to bayesplot::theme_default()
     * Does _not_ affect other ggplot2 plots
     * See ?bayesplot_theme_set for details on theme setting
     >
     > Sys.unsetenv("R_TESTS")
     > test_check("bayesplot")
     ── 1. Error: (unknown) (@test-extractors.R#2) ─────────────────────────────────
     there is no package called 'rstanarm'
     Backtrace:
     1. base::suppressPackageStartupMessages(library(rstanarm))
     3. base::library(rstanarm)
    
     ── 2. Error: prepare_mcmc_array processes non-array input types correctly (@test
     there is no package called 'rstanarm'
     Backtrace:
     1. base::suppressPackageStartupMessages(library(rstanarm))
     3. base::library(rstanarm)
    
     ── 3. Error: (unknown) (@test-mcmc-nuts.R#2) ──────────────────────────────────
     there is no package called 'rstanarm'
     Backtrace:
     1. base::suppressPackageStartupMessages(library(rstanarm))
     3. base::library(rstanarm)
    
     ── 4. Error: (unknown) (@test-mcmc-recover.R#2) ───────────────────────────────
     there is no package called 'rstanarm'
     Backtrace:
     1. base::suppressPackageStartupMessages(library(rstanarm))
     3. base::library(rstanarm)
    
     ── 5. Error: (unknown) (@test-mcmc-scatter-and-parcoord.R#2) ──────────────────
     there is no package called 'rstanarm'
     Backtrace:
     1. base::suppressPackageStartupMessages(library(rstanarm))
     3. base::library(rstanarm)
    
     ── 6. Error: (unknown) (@test-ppc-discrete.R#2) ───────────────────────────────
     there is no package called 'rstanarm'
     Backtrace:
     1. base::suppressPackageStartupMessages(library(rstanarm))
     3. base::library(rstanarm)
    
     ── 7. Error: (unknown) (@test-ppc-loo.R#2) ────────────────────────────────────
     there is no package called 'rstanarm'
     Backtrace:
     1. base::suppressPackageStartupMessages(library(rstanarm))
     3. base::library(rstanarm)
    
     ══ testthat results ═══════════════════════════════════════════════════════════
     [ OK: 789 | SKIPPED: 33 | WARNINGS: 0 | FAILED: 7 ]
     1. Error: (unknown) (@test-extractors.R#2)
     2. Error: prepare_mcmc_array processes non-array input types correctly (@test-helpers-mcmc.R#244)
     3. Error: (unknown) (@test-mcmc-nuts.R#2)
     4. Error: (unknown) (@test-mcmc-recover.R#2)
     5. Error: (unknown) (@test-mcmc-scatter-and-parcoord.R#2)
     6. Error: (unknown) (@test-ppc-discrete.R#2)
     7. Error: (unknown) (@test-ppc-loo.R#2)
    
     Error: testthat unit tests failed
     Execution halted
Flavor: r-release-linux-x86_64